Home > Cannot Open > Uuid.lib Download

Uuid.lib Download


All rights reserved. "C:\Program Files\Microsoft Visual Studio 8\VC\BIN\nmake.exe" -f Makefil e.Release Microsoft (R) Program Maintenance Utility Version 8.00.50727.42 Copyright (C) Microsoft Corporation. That's useful. Real numbers which are writable as a differences of two transcendental numbers My cat sat down on my laptop, now the right side of my keyboard types the wrong characters Sites: Teenage daughter refusing to go to school addFieldToFilter() And Condition in magento2 Select 2D data in a certain range My cat sat down on my laptop, now the right side of have a peek here

C:\Qt\4.2.0>cd C:\Qt\4.2.0\examples\tutorial\t1 C:\Qt\4.2.0\examples\tutorial\t1>qmake -project C:\Qt\4.2.0\examples\tutorial\t1>qmake C:\Qt\4.2.0\examples\tutorial\t1>make 'make' is not recognized as an internal or external command, operable program or batch file. But i have never been able to successfully compile my project with 5.1.0. share|improve this answer edited Jul 7 '15 at 21:59 Community♦ 11 answered Feb 24 '13 at 15:59 Zaid Amir 2,27122563 There are a lot of directories. more stack exchange communities company blog Stack Exchange Inbox Reputation and Badges sign up log in tour help Tour Start here for a quick overview of the site Help Center Detailed this page

Uuid.lib Download

gyandeeps commented Mar 10, 2015 @ktrzeciaknubisa stuck with the same error. PolymerElements/polymer-starter-kit#500 Open Installing issue lostella/ForBES#2 Sign up for free to join this conversation on GitHub. uuid.lib is provided by the Windows SDK which is installed either with Visual Studio (separate) or by the included Visual Studio 2008 Shell. The system returned: (22) Invalid argument The remote host or network may be down.

samccone referenced this issue in prantlf/node-posix-ext Sep 23, 2014 Closed install fails on windows #1 ZachMoreno commented Oct 7, 2014 Good look @samccone ! You need to check this storehouse and if file is there - then just restore it. Re-installing the application may fix this problem." jacek16th October 2006, 20:08LINK : fatal error LNK1104: cannot open file 'uuid.lib' It looks like m$ linker can't find "uuid.lib" library. Steve - Intel Developer Support Top cuseken_14870 Wed, 11/04/2009 - 08:54 Quoting - Steve Lionel (Intel) At this point, I suggest downloading the Microsoft Windows SDK and installing it.

Personal Open source Business Explore Sign up Sign in Pricing Blog Support Search GitHub This repository Watch 166 Star 2,654 Fork 483 nodejs/node-gyp Code Issues 202 Pull requests 14 Projects Link Fatal Error Lnk1104 Cannot Open File C Program Obj thanks a lot! –Alberto Oct 13 '14 at 16:35 2 this was my problem too! –kami Nov 18 '14 at 17:35 add a comment| up vote 4 down vote I Top Steve Lionel (Intel) Fri, 10/30/2009 - 14:17 Do you have a folder named SDK or something like that under C:Program FilesMicrosoft Visual Studio 9.0VC? Forums Search Forums Recent Posts Unanswered Threads Videos Search Media New Media Members Notable Members Current Visitors Recent Activity New Profile Posts Insights Search Log in or Sign up Physics Forums

how can i tell?Thanks dimanche 4 février 2007 14:50 0 Connectez-vous pour voter I had the same problem. TooTallNate closed this in #510 May 25, 2015 This was referenced Jun 10, 2015 Closed node-gyp fails on windows7, node 0.12.2, npm 2.7.4, node-gyp 1.0.3 dainis/node-gcstats#8 Closed [Windows] Missing Python/VCBuild dependency? Please download a browser that supports JavaScript, or enable it if it's disabled (i.e. Google didn't help much, but I found a post here that seemed similar to mine but the answers didn't do much justice.

Link Fatal Error Lnk1104 Cannot Open File C Program Obj

I searched on Google and even here on Stackoverflow. http://stackoverflow.com/questions/15053337/fatal-error-lnk1104-cannot-open-file-kernel32-lib share|improve this answer answered Dec 4 '14 at 21:58 Nicko Po 533315 add a comment| up vote 1 down vote I checked all my settings according to this list: http://msdn.microsoft.com/en-us/library/ts7eyw4s.aspx#feedback . Uuid.lib Download How Did The Dred Scott Decision Contribute to the Civil War? Libuuid When you get to the component selection dialog, make it look like this: Ignore the warning that some pieces needed for VS are missing.

How to show that something is not completely metrizable more hot questions question feed lang-cpp about us tour help blog chat data legal privacy policy work here advertising info mobile contact navigate here http://msdn.microsoft.com/vstudio/express/ Afflicted.d216th October 2006, 19:18I did as you told me but... If there is no .pro file with the sources, you will have to run "qmake -project" before "qmake". Steve - Intel Developer Support Top cuseken_14870 Fri, 10/30/2009 - 11:53 Quoting - Steve Lionel (Intel) In what environment are you building the program? Unresolved External Symbol

Build FAILED. "C:\cygwin64\home\IEguy\repos\node-posix-ext\build\binding.sln" (default target) (1) -> "C:\cygwin64\home\IEguy\repos\node-posix-ext\build\posix-ext.vcxproj" (default target) (2) -> (ClCompile target) -> C:\Users\IEguy\.node-gyp\0.10.32\deps\v8\include\v8.h(179): warning C4506: no definition for inline function 'v8::Persistent v8::Persistent::New(v8::Handle)' [C:\cygwin64\home\IEguy\repos\node-posix-ext\build\posix-ext.vcxproj] C:\Users\IEguy\.node-gyp\0.10.32\deps\v8\include\v8.h(184): warning C4506: no definition jeudi 16 août 2007 06:40 0 Connectez-vous pour voter Hello there,   I'm also having a similar problem with LNK1104 as a result of uuid.lib cannot be opened. Am i wrong? :D PLA, Nov 21, 2012 Nov 21, 2012 #4 jedishrfu Staff: Mentor a lib is a collection of objs so its reasonable to be there. Check This Out This will be C:Program FilesMicrosoft SDKsWindowsv6.1Lib for IA32 and C:Program FilesMicrosoft SDKsWindowsv6.1Libx64 for Intel 64.

I am using Microsoft Visual Studio 2008 Shell and Libraries. I installed it in order to run another program (SINDA) which uses the VF complier. NMAKE : fatal error U1077: '"C:\Program Files\Microsoft Visual Studio 8\VC\BIN\n make.exe"' : return code '0x2' Stop.

Our first try should always be close and reopen (or power off and on) - several mysterious bugs goes away when we do that... –Leonardo Alves Machado Apr 15 at 14:48

InitializeBuildStatus: Creating "Release\obj\posix-ext\posix-ext.unsuccessfulbuild" because "AlwaysCreate" was specified. visual-studio-2010 visual-c++ libraries share|improve this question edited Jan 3 at 8:05 STF 6021326 asked Feb 24 '13 at 15:37 0x499602D2 57.5k1990168 2 I'd try this: First search your Program Files You should edit this list separately for Debug and Release. What was wrong for me was that i was still including a header for the package i just uninstalled in one of my .cpp files (pretty silly, yes).

cl : Command line warning D9007 : '/Gm' requires '/Zi or /ZI'; option ignored main.cpp Linking... Then reinstall using the "full" package from the latest Intel Visual Fortran update (update 2 or 3 if available). Copy and paste the contents into a reply here. this contact form share|improve this answer answered Sep 26 '13 at 5:20 harsini 1469 add a comment| up vote 3 down vote My problem was a missing .lib extension, I was just linking against

Please help me if you can. Steve - Intel Developer Support Top Back to original post Leave a Comment Please sign in to add a comment. That's the program (a really base one): Code (Text): #include #include #include #include #include using namespace std; using namespace osg; int main(int argc, char *argv[]) { Internet Protocols and Support »...(the UUID class) and the functions uuid1(), uuid3(), uuid4(), uuid...docs.python.org/2/library/uuid.html Why Can I Not Link Some uuid.lib Symbols in a 32-bit Program?...I have a LabWindows™/CVI 9.0 or

Thanks for your help. When I compile the project, I receive the following fatal error: fatal error LNK1104: cannot open file 'C:\Program.obj' visual-c++ linker share|improve this question edited Sep 25 '08 at 14:35 asked Sep When I select "debug", it tells me that "An unhandled Win32 exception occurred in astap.exe [1476]" and asks me to select from two possible debuggers, VS2005 and VS2008. This issue was fixed by changing this property from: C:\Program Files\sofware sdk\lib\library.lib To: " C:\Program Files\sofware sdk\lib\library.lib" share|improve this answer edited Sep 25 '08 at 14:40 answered Sep 25 '08 at

and have you done this: When using VisualStudio 2005 Express, make sure that you have installed MS Platform SDK and that the environment variables are set correct. share|improve this answer answered Dec 11 '15 at 5:16 SpicyWeenie 69221957 add a comment| Your Answer draft saved draft discarded Sign up or log in Sign up using Google Sign thanks Attachments: AttachmentSize Download install1.bmp991.99 KB Download install2.bmp364.88 KB Top Steve Lionel (Intel) Mon, 11/02/2009 - 10:44 At this point, I suggest downloading the Microsoft Windows SDK and installing it.