Home > Cannot Run > Cannot Run Program "aapt": Error=2, No Such File Or Directory

Cannot Run Program "aapt": Error=2, No Such File Or Directory

Contents

more hot questions question feed lang-java about us tour help blog chat data legal privacy policy work here advertising info mobile contact us feedback Technology Life / Arts Culture / Recreation Moving a member function from base class to derived class breaks the program for no obvious reason At delivery time, client criticises the lack of some features that weren't written on So please help me, I think I am not far away from the answer. solved by : sudo apt-get install lib32stdc++6 sudo apt-get install lib32z1 ///////////////////////////////////// Thanks from me too :) success Dec 6, 2014 #16 mail0339...@gmail.com solved by : sudo apt-get install lib32stdc++6 his comment is here

How difficult is it to practically detect a forgery in a cryptosystem? Unpacking lib32stdc++6 (from .../lib32stdc++6_4.8.1-10ubuntu9_amd64.deb) ... After this operation, 178 kB of additional disk space will be used. Why is Professor Lewin correct regarding dimensional analysis, and I'm not?

Cannot Run Program "aapt": Error=2, No Such File Or Directory

Move To Video Answer Error:android-apt-compiler: Cannot run program “sdk_path/build-tools/21.1.2/aapt”: java.io.IOException: error=13, Permission denied Tags: android intellij-idea aapt By : Amitabha Biswas Source: Stackoverflow.com Question! more stack exchange communities company blog Stack Exchange Inbox Reputation and Badges sign up log in tour help Tour Start here for a quick overview of the site Help Center Detailed I'm working with upgrading a WLI-application from WLI 8.1 to WLI 10.3.

However with help of http://www.wikihow.com/Install-Android-on-Ubuntu-Linux-with-Eclipse-IDE, I tried to install eclispse-andriod successfully.- vide screen-shot. Is this Business or Tourism? When running the script I got following error: /home/jele41/TAB-10/AxsTuxedo/AxsTuxedoUtil/build_AxsTuxedoUtil.xml:125: The following error occurred while executing this line: //opt/bea/bea_home/bea_wli103/workshop_10.3/weblogic-beehive/ant/weblogic-beehive-buildmodules.xml:146: The following error occurred while executing this line: /opt/bea/bea_home/bea_wli103/workshop_10.3/weblogic-beehive/ant/weblogic-beehive-tools.xml:86: Error running apt compiler Error Aapt Exe Exited With Code Execute bash script from vim What was Stan Lee's character reading on the bus in Doctor Strange "Carrie has arrived at the airport for two hours." - Is this sentence grammatically

Accept & Close Find best Answer ☰ Menu intellij-idea aapt java c# php android jquery python Home->Error:android-apt-compiler: Cannot run program “s This Question have no Text answers yet! Error:cannot Run Program Error=2, No Such File Or Directory Intellij e.g. "sudo apt-get install " With regards, sriranga(80yrs) Mar 17, 2014 Project Member #5 vs...@google.com If you are new to this, please use ADT and download the bundle; Mar 17, 2014 Project Member #7 x...@android.com (we do not provide 64 bit versions of these tools) Mar 17, 2014 #8 calid...@gmail.com encounterred the same problem. http://stackoverflow.com/questions/30082857/errorandroid-apt-compiler-cannot-run-program-sdk-path-build-tools-21-1-2-aapt Thank you for reporting the bug, which will now be closed.

Regards, Kal. "aapt.exe" Exited With Code -1073741819 Visual Studio Pre Compiler Build aborted21Error: Cannot run aapt1Error executing aapt: Cannot run program, CreateProcess error=5, Access is denied: CreateProcess error=5, Access is denied2Type Error executing aapt: Cannot run program “/opt/android-sdk-linux/build-tools/19.0.1/aapt”: java.io.IOException1Android Studio Why did Michael Corleone not forgive his brother Fredo? During the Building I have this Error message: :Client:mergeDebugResources /var/lib/jenkins/workspace/LMA-Client/Client/build/exploded-aar/com.google.android.gms/play-services/3.1.59/res/drawable-hdpi/common_signin_btn_text_focus_light.9.png: Error: Cannot run program "/opt/android-sdk/build-tools/19.0.1/aapt": java.io.IOException: error=2, No such file or directory :Client:mergeDebugResources FAILED You can imagine that this aapt...

Error:cannot Run Program Error=2, No Such File Or Directory Intellij

Everything should work properly ! https://community.oracle.com/thread/1020535 If you kindly suggest which version easily can installed, i shall try again. Cannot Run Program "aapt": Error=2, No Such File Or Directory This is my pillow Did a thief think he could conceal his identity from security cameras by putting lemon juice on his face? Error:android-apt-compiler: No Build Tools In The Android Sdk. share|improve this answer answered May 16 '13 at 16:40 xorgate 1,2551023 add a comment| up vote 2 down vote Thanks for the tip!

Please turn JavaScript back on and reload this page. this content Then enter the following commands one by one, in terminal. Unpacking lib32gcc1 (from .../lib32gcc1_1%3a4.8.1-10ubuntu9_amd64.deb) ... Go to platform-tools, then create links for aapt.exe, aidl.exe, dexdump.exe, dx.bat, and lib\dx.jar to their counterparts in build-tools\17.0.0 and build-tools\17.0.0\lib. Error 2 No Such File Or Directory Linux

Teenage daughter refusing to go to school How do pilots identify the taxi path to the runway? A guy scammed me, but he gave me a bank account number & routing number. How safe is 48V DC? http://dekovsoft.com/cannot-run/cannot-run-program-library-internet-error-2.html Converting the weight of a potato into a letter grade I changed one method signature and broke 25,000 other classes.

Error:android-apt-compiler: Cannot run program "sdk_path/build-tools/21.1.2/aapt": java.io.IOException: error=13, Permission denied May I know you how can I solve this error? Aapt Cannot Execute Binary File still its showing " ADB not responding. What is the temperature of the brakes after a typical landing?

And how?

Not the answer you're looking for? its there too, so the mistake must be somewhere else. share|improve this answer edited May 11 '13 at 0:25 belacqua 13.2k136595 answered Sep 7 '12 at 5:43 Naveen 4,26142957 1 Hmm, we could really use a 'aptgetsane' script to triage Android Studio Aapt Error more stack exchange communities company blog Stack Exchange Inbox Reputation and Badges sign up log in tour help Tour Start here for a quick overview of the site Help Center Detailed

What is with the speech audience? Browse other questions tagged android intellij-idea aapt or ask your own question. Where do I drop off a foot passenger in Calais (P&O)? http://dekovsoft.com/cannot-run/cannot-run-program-mkdir-createprocess-error-2.html Note ldd aapt now works, and shows dependencies.

Need to get 57.5 kB of archives. It would be neat to revert to installation defaults, while saving all the original settings, to diagnose said issues. –ppetraki Oct 3 '12 at 15:44 add a comment| Your Answer It looks to me like it 's looking for some file that the "apt" command needs. Compare elements iteratively Is there a word for turning something into a competition?

Please turn JavaScript back on and reload this page.