Home > Cannot Run > Java.io.ioexception: Cannot Run Program Jenkins

Java.io.ioexception: Cannot Run Program Jenkins

Contents

Format For Printing -XML -Clone This Bug -Top of page First Last Prev Next This bug is not in your last search results. Because I'm all out. How to reset the WiFi configuration in Raspbian Is it anti-pattern if a class property creates and returns a new instance of a class? If you run your gradle build from the same terminal you have Docker open, it solved the issue. his comment is here

jportway: initial checkin of project into subversion Stacktrace: java.io.IOException: Cannot run program "svn": error=2, No such file or directory at java.lang.ProcessBuilder.start(ProcessBuilder.java:459) at java.lang.Runtime.exec(Runtime.java:593) at java.lang.Runtime.exec(Runtime.java:509) at org.netbeans.modules.subversion.client.cli.Commandline.exec(Commandline.java:113) at org.netbeans.modules.subversion.client.cli.CommandlineClient.exec(CommandlineClient.java:729) at org.netbeans.modules.subversion.client.cli.CommandlineClient.propertyGet(CommandlineClient.java:559) You signed in with another tab or window. I usually install my python packages within a virtualenv so I don't have to manually fiddle with the PATH variable. Need to change cash to cashier's check without bank account (Just arrived to the US) Why there are no approximation algorithms for SAT and other decision problems?

Java.io.ioexception: Cannot Run Program Jenkins

What is with the speech audience? Sponsored by Sign In Create Account Search among 980,000 solutions Search Your bugs help others We want to create amazing apps without being stopped by crashes. more stack exchange communities company blog Stack Exchange Inbox Reputation and Badges sign up log in tour help Tour Start here for a quick overview of the site Help Center Detailed Make sure the user running the java program have access to those files (a+rwx if you just want to discard a permissions problem...

Thanks! at org.gradle.api.internal.tasks.execution.ExecuteActionsTaskExecuter.executeActions(ExecuteActionsTaskExecuter.java:69) at org.gradle.api.internal.tasks.execution.ExecuteActionsTaskExecuter.execute(ExecuteActionsTaskExecuter.java:46) at org.gradle.api.internal.tasks.execution.PostExecutionAnalysisTaskExecuter.execute(PostExecutionAnalysisTaskExecuter.java:35) at org.gradle.api.internal.tasks.execution.SkipUpToDateTaskExecuter.execute(SkipUpToDateTaskExecuter.java:64) at org.gradle.api.internal.tasks.execution.ValidatingTaskExecuter.execute(ValidatingTaskExecuter.java:58) at org.gradle.api.internal.tasks.execution.SkipEmptySourceFilesTaskExecuter.execute(SkipEmptySourceFilesTaskExecuter.java:52) at org.gradle.api.internal.tasks.execution.SkipTaskWithNoActionsExecuter.execute(SkipTaskWithNoActionsExecuter.java:52) at org.gradle.api.internal.tasks.execution.SkipOnlyIfTaskExecuter.execute(SkipOnlyIfTaskExecuter.java:53) at org.gradle.api.internal.tasks.execution.ExecuteAtMostOnceTaskExecuter.execute(ExecuteAtMostOnceTaskExecuter.java:43) at org.gradle.execution.taskgraph.DefaultTaskGraphExecuter$EventFiringTaskWorker.execute(DefaultTaskGraphExecuter.java:203) at org.gradle.execution.taskgraph.DefaultTaskGraphExecuter$EventFiringTaskWorker.execute(DefaultTaskGraphExecuter.java:185) at org.gradle.execution.taskgraph.AbstractTaskPlanExecutor$TaskExecutorWorker.processTask(AbstractTaskPlanExecutor.java:62) at org.gradle.execution.taskgraph.AbstractTaskPlanExecutor$TaskExecutorWorker.run(AbstractTaskPlanExecutor.java:50) at org.gradle.execution.taskgraph.DefaultTaskPlanExecutor.process(DefaultTaskPlanExecutor.java:25) at org.gradle.execution.taskgraph.DefaultTaskGraphExecuter.execute(DefaultTaskGraphExecuter.java:110) at That shebang works after the script is installed with setuptools, but if you just want to edit your PATH and run an arbitrary script found in your PATH, you may need Createprocess Error=2 The System Cannot Find The File Specified Java vBulletin 2000 - 2016, Jelsoft Enterprises Ltd.

I changed one method signature and broke 25,000 other classes. Error:java.io.ioexception: Error=2, No Such File Or Directory Android Studio What now? asked 4 years ago viewed 16553 times active 10 days ago Upcoming Events 2016 Community Moderator Election ends Nov 22 Visit Chat Linked 0 Run perl script through Java using ProcessBuilder http://stackoverflow.com/questions/16482601/java-io-ioexception-cannot-run-program-java-io-ioexception-error-2-no Any other ideas?

Reload to refresh your session. Error 2 No Such File Or Directory Zip Why won't curl download this link when a browser will? PW -- Paul Webster http://wiki.eclipse.org/Platform_Command_Framework http://wiki.eclipse.org/Command_Core_Expressions http://wiki.eclipse.org/Menu_Contributions http://wiki.eclipse.org/Menus_Extension_Mapping http://help.eclipse.org/galileo/index.jsp?topic=/org.eclipse .platform.doc.isv/guide/workbench.htm Report message to a moderator Previous Topic:Fixing a compile error requires closing an unrelated project Next Join Now I want to fix my crash I want to help others java.io.IOException: Cannot run program "git": error=2, No such file or directory Stack Overflow | Shubhankar Raj | 1

Error:java.io.ioexception: Error=2, No Such File Or Directory Android Studio

Thanks. https://github.com/awslabs/amazon-kinesis-client-python/issues/1 My user has r/w permissions, yes. Java.io.ioexception: Cannot Run Program Jenkins You probably intended to construct a command containing the command and its arguments as a sequence of strings, instead of a single string: String[] command = { "/bin/bash", "-c", "ssh " Java Runtime Error=2 No Such File Or Directory Thus, the current directory is excluded from the PATH.

Accept & Close Skip to main content Download Getting Started Members Projects Community Marketplace Events Planet Eclipse Newsletter Videos Participate Report a Bug Forums Mailing Lists Wiki IRC How to Contribute this content In Doctor Strange what was the title of the book Stan Lee was reading in his cameo? more stack exchange communities company blog Stack Exchange Inbox Reputation and Badges sign up log in tour help Tour Start here for a quick overview of the site Help Center Detailed executableName = python /app.py Another approach that I'd suggest if you're using virtualenv, is to define a setup.py and install your script before running the MultiLangDaemon. Java Processbuilder Cannot Run Program No Such File Or Directory

Draw a hollow square of # with given width Why does low frequency RFID have a short read range? Restarting NetBeans solved the problem most of the time. Tenzer commented Oct 30, 2014 @sid137 Do you have app.py in the current working directory while running that command? weblink share|improve this answer answered May 10 '13 at 12:49 Mike Samuel 75.4k16142183 tried too: Unknown option: --convert-to pdf:'writer_pdf_Export' –Azathoth May 10 '13 at 12:54 1 @Azathoth, get rid

knorwood commented Oct 30, 2014 @sid137, Another approach to try is to define the executableName to be python with the full path to the script as its argument, like this. Java.io.ioexception Cannot Run Program Permission Denied I've hit a small issue in that java can't find my program: java.io.IOException: Cannot run program "consumers.py": error=2, No such file or directory I've set the executableName = consumers.py in my In eclipse, it must not be (which is possible if you launch eclipse from an icon but not the command line).

I echo the $PATH variable when executing from Linux machine and Autosys in the shell script, $PATH variable is not set properly when executing from Autosys , after appending user command

What am i doing wrong? I ended up logging out of Gnome then back in to solve the problem. How to fix this issue? Java Io Ioexception Cannot Run Program Arduino Do humans have an obligation to prevent animal on animal violence?

This is my pillow Can I hint the optimizer by giving the range of an integer? Try: Run with --info or --debug option to get more log output. Then the file or folder not found error is gone. check over here We recommend upgrading to the latest Safari, Google Chrome, or Firefox.

This site uses cookies, as explained in our cookie policy. I was facing this issue when I was trying to run gradle from within my Eclipse. Try setting the working directory, in the launch configuration, to wherever it is you're running it from the command line. SiteMap About Us Contact Legal & Licences By use of this website, you agree to the NetBeans Policies and Terms of Use. © 2014, Oracle Corporation and/or its affiliates.

sid137 commented Oct 30, 2014 @knorwood Thank you! But again, thanks for getting this out - I was running a "consumer" with celery tasks until now, which worked, but very happy to using the official KCL without having to Because I'm all out. That I should break down the shell script? –ickarsim Sep 4 '14 at 8:22 @jim clean.sh have 755, user running the java program owns the clean.sh so accessing shouldn't

What's the name of style where GM assumes idiotic behaviour unless stated otherwise? Bug156713 - java.io.IOException: Cannot run program "svn": error=2, No such file or directory Summary: java.io.IOException: Cannot run program "svn": error=2, No such file or direc...